BDBM50021541 (R,S)S 2-(3-Acetylsulfanyl-2-methyl-propionyl)-1,2,3,4-tetrahydro-isoquinoline-3-carboxylic acid::CHEMBL58720
SMILES CC(CSC(C)=O)C(=O)N1Cc2ccccc2CC1C(O)=O
InChI Key InChIKey=JOXYJWCHVDBFQT-UHFFFAOYSA-N
Data  1 IC50
  Tab Delimited (TSV)   2D SDfile   Computed 3D by Vconf -m prep SDfile
Find this compound or compounds like it in BindingDB:
Activity Spreadsheet -- Enzyme Inhibition Constant Data from BindingDB
Found 1 hit for monomerid = 50021541
TargetAngiotensin-converting enzyme(Homo sapiens (Human))
TBA
Curated by ChEMBL
LigandPNGBDBM50021541((R,S)S 2-(3-Acetylsulfanyl-2-methyl-propionyl)-1,2...)
Affinity DataIC50:  130nM. Assay description: Inhibition of guinea pig angiotensin I converting enzyme
In DepthDetails ArticlePubMed