BDBM50021542 1-(3,4-Dihydro-1H-isoquinolin-2-yl)-3-mercapto-2-methyl-propan-1-one::CHEMBL59354
SMILES CC(CS)C(=O)N1CCc2ccccc2C1
InChI Key InChIKey=TYLXHTVATOWOEK-UHFFFAOYSA-N
Data  1 IC50
  Tab Delimited (TSV)   2D SDfile   Computed 3D by Vconf -m prep SDfile
Find this compound or compounds like it in BindingDB:
Activity Spreadsheet -- Enzyme Inhibition Constant Data from BindingDB
Found 1 hit for monomerid = 50021542
TargetAngiotensin-converting enzyme(Homo sapiens (Human))
TBA
Curated by ChEMBL
LigandPNGBDBM50021542(1-(3,4-Dihydro-1H-isoquinolin-2-yl)-3-mercapto-2-m...)
Affinity DataIC50:  4.80E+4nM. Assay description: Inhibition of guinea pig angiotensin I converting enzyme
In DepthDetails ArticlePubMed