BDBM50022408 CHEMBL82299::Indan-1-carboxylic acid
SMILES OC(=O)C1CCc2ccccc12
InChI Key InChIKey=JBQMFBWTKWOSQX-UHFFFAOYSA-N
Data  1 IC50
  Tab Delimited (TSV)   2D SDfile   Computed 3D by Vconf -m prep SDfile
Find this compound or compounds like it in BindingDB:
Activity Spreadsheet -- Enzyme Inhibition Constant Data from BindingDB
Found 1 hit for monomerid = 50022408
TargetAldo-keto reductase family 1 member B1 [K65Q](Bos taurus (Cattle))
Pfizer
Curated by ChEMBL
LigandPNGBDBM50022408(CHEMBL82299 | Indan-1-carboxylic acid)
Affinity DataIC50: >1.00E+5nM. Assay description: In vitro inhibition of partially purified calf lens aldose reductase
In DepthDetails ArticlePubMed