BDBM50023447 Ginsenoside Rh1
SMILES [H][C@@]1([#6]-[#6][C@]2([#6])[C@]1([H])[#6@H](-[#8])-[#6][C@]1([H])[C@@]3([#6])[#6]-[#6]-[#6@H](-[#8])C([#6])([#6])[C@]3([H])[#6@H](-[#6][C@@]21[#6])-[#8][C@]1([H])[#8]-[#6@H](-[#6]-[#8])-[#6@@H](-[#8])-[#6@H](-[#8])-[#6@H]1-[#8])[C@@]([#6])([#8])[#6]-[#6]\[#6]=[#6](\[#6])-[#6]
InChI Key InChIKey=RAQNTCRNSXYLAH-RFCGZQMISA-N
Data  1 IC50
  Tab Delimited (TSV)   2D SDfile   Computed 3D by Vconf -m prep SDfile
Find this compound or compounds like it in BindingDB:
Activity Spreadsheet -- Enzyme Inhibition Constant Data from BindingDB
Found 1 hit for monomerid = 50023447
TargetAldo-keto reductase family 1 member B1(Homo sapiens (Human))
Kyushu University
Curated by ChEMBL
LigandPNGBDBM50023447(Ginsenoside Rh1)
Affinity DataIC50: >2.00E+5nM. Assay description: Inhibition of human recombinant aldose reductase using DL-glyceraldehyde, HRAR and beta-NADPH incubated for 10 mins by spectrophotometry
In DepthDetails ArticlePubMed