BDBM50023607 CHEMBL3355579
SMILES COc1cc(CCC(=O)\C=C\CCCNc2c3C4CC(CC(C)=C4)Cc3nc3cc(Cl)ccc23)ccc1O
InChI Key InChIKey=XLIOMHFQNGCWAV-GQCTYLIASA-N
Data  2 IC50
  Tab Delimited (TSV)   2D SDfile   Computed 3D by Vconf -m prep SDfile
Find this compound or compounds like it in BindingDB:
Activity Spreadsheet -- Enzyme Inhibition Constant Data from BindingDB
Found 2 hits for monomerid = 50023607
TargetAcetylcholinesterase(Homo sapiens (Human))
Universitat De Barcelona
Curated by ChEMBL
LigandPNGBDBM50023607(CHEMBL3355579)
Affinity DataIC50:  6.70nM. Assay description: Inhibition of human recombinant AChE using acetylthiocholine iodide as substrate preincubated for 20 mins before substrate addition by Ellman method
In DepthDetails ArticlePubMed
TargetCholinesterase(Homo sapiens (Human))
Universitat De Barcelona
Curated by ChEMBL
LigandPNGBDBM50023607(CHEMBL3355579)
Affinity DataIC50:  982nM. Assay description: Inhibition of human serum BChE using butyrylthiocholine iodide preincubated for 20 mins before substrate addition by Ellman method
In DepthDetails ArticlePubMed