BDBM50024214 Boc-alpha-MePro-Phe-His-Leu si[CHOHCH2]Val-Ile-Amp::Boc-alpha-MePro-Phe-His-Leu si[CHOHCH2]Val-Ile-Amp dicitrate::CHEMBL3144386
SMILES OC(=O)CC(O)(CC(O)=O)C(O)=O.OC(=O)CC(O)(CC(O)=O)C(O)=O.CC[C@H](C)[C@H](NC(=O)[C@@H](NC[C@H](O)[C@H](CC(C)C)NC(=O)[C@H](Cc1c[nH]cn1)NC(=O)[C@H](Cc1ccccc1)NC(=O)[C@]1(C)CCCN1C(=O)OC(C)(C)C)C(C)C)C(=O)NCc1ccccn1
InChI Key InChIKey=QQZMWHRPVNRMTA-GWFJCOKLSA-N
Data  1 IC50
  Tab Delimited (TSV)   2D SDfile   Computed 3D by Vconf -m prep SDfile
Find this compound or compounds like it in BindingDB:
Activity Spreadsheet -- Enzyme Inhibition Constant Data from BindingDB
Found 1 hit for monomerid = 50024214
TargetRenin(Homo sapiens (Human))
TBA
Curated by ChEMBL
LigandPNGBDBM50024214(Boc-alpha-MePro-Phe-His-Leu si[CHOHCH2]Val-Ile-Amp...)
Affinity DataIC50:  1.60nM. Assay description: In vitro inhibition against human plasma renin.
In DepthDetails ArticlePubMed