BDBM50024388 CHEMBL190621
SMILES CCOP(=O)(N1Cc2ccccc2C[C@@H]1C(=O)NO)c1ccc(Oc2ccc(N)cc2)cc1
InChI Key InChIKey=BJNHISLNENZLDD-PXWGLLCJSA-N
Data  1 KI
  Tab Delimited (TSV)   2D SDfile   Computed 3D by Vconf -m prep SDfile
Find this compound or compounds like it in BindingDB:
Activity Spreadsheet -- Enzyme Inhibition Constant Data from BindingDB
Found 1 hit for monomerid = 50024388
TargetMatrix metalloproteinase-9(Homo sapiens (Human))
North Dakota State University
Curated by ChEMBL
LigandPNGBDBM50024388(CHEMBL190621)
Affinity DataKi:  0.100nM. Assay description: Inhibition of MOCAc-Pro-Leu-Gly-Leu-A2p (Dnp)-Ala-Arg-NH2 binding to human matrix metalloprotease-9 (MMP-9)
In DepthDetails ArticlePubMed