BDBM50024591 Ammonium-methanephosphonic acid anion::CHEMBL41873
SMILES [NH3+]CP(O)([O-])=O
InChI Key InChIKey=MGRVRXRGTBOSHW-UHFFFAOYSA-N
Data  1 KI
  Tab Delimited (TSV)   2D SDfile   Computed 3D by Vconf -m prep SDfile
Find this compound or compounds like it in BindingDB:
Activity Spreadsheet -- Enzyme Inhibition Constant Data from BindingDB
Found 1 hit for monomerid = 50024591
TargetCytosol aminopeptidase(Homo sapiens (Human))
TBA
Curated by ChEMBL
LigandPNGBDBM50024591(Ammonium-methanephosphonic acid anion | CHEMBL4187...)
Affinity DataKi:  1.04E+6nM. Assay description: Inhibition of Leucine aminopeptidase isolated from porcine kidney.
In DepthDetails ArticlePubMed