BDBM50024596 (R)-1-Ammonium-2-phenyl-ethanephosphonic acid anion::CHEMBL40813::[(1R)-1-amino-2-phenylethyl]phosphonic acid
SMILES [NH3+][C@@H](Cc1ccccc1)P(O)([O-])=O
InChI Key InChIKey=FQCNOURLMNHAQN-MRVPVSSYSA-N
Data  1 KI
PDB links: 1 PDB ID matches this monomer.
  Tab Delimited (TSV)   2D SDfile   Computed 3D by Vconf -m prep SDfile
Find this compound or compounds like it in BindingDB:
Activity Spreadsheet -- Enzyme Inhibition Constant Data from BindingDB
Found 1 hit for monomerid = 50024596
TargetCytosol aminopeptidase(Homo sapiens (Human))
TBA
Curated by ChEMBL
LigandPNGBDBM50024596((R)-1-Ammonium-2-phenyl-ethanephosphonic acid anio...)
Affinity DataKi:  420nM. Assay description: Inhibition of Leucine aminopeptidase isolated from porcine kidney.
In DepthDetails ArticlePubMed