BDBM50024598 2-[(1-Ammonium-3-methyl-butyl)-hydroxy-phosphinoyloxymethyl]-4-methyl-pentanoic acid anion
SMILES CC(C)CC([NH3+])P([O-])(=O)OC[C@@H](CC(C)C)C([O-])=O
InChI Key InChIKey=TZYPULNAMDNJEQ-NFJWQWPMSA-M
Data  1 KI
  Tab Delimited (TSV)   2D SDfile   Computed 3D by Vconf -m prep SDfile
Find this compound or compounds like it in BindingDB:
Activity Spreadsheet -- Enzyme Inhibition Constant Data from BindingDB
Found 1 hit for monomerid = 50024598
TargetCytosol aminopeptidase(Homo sapiens (Human))
TBA
Curated by ChEMBL
LigandPNGBDBM50024598(2-[(1-Ammonium-3-methyl-butyl)-hydroxy-phosphinoyl...)
Affinity DataKi:  5.80E+4nM. Assay description: Inhibition of Leucine aminopeptidase isolated from porcine kidney.
In DepthDetails ArticlePubMed