BDBM50024823 5-Methoxy-1,2,3,4-tetrahydro-1,4-methano-naphthalen-9-ylamine::CHEMBL70415
SMILES COc1cccc2C3CCC([C@H]3N)c12
InChI Key InChIKey=GRAHABHHHLNBDF-KWPJZBAWSA-N
Data  1 KI
  Tab Delimited (TSV)   2D SDfile   Computed 3D by Vconf -m prep SDfile
Find this compound or compounds like it in BindingDB:
Activity Spreadsheet -- Enzyme Inhibition Constant Data from BindingDB
Found 1 hit for monomerid = 50024823
TargetPhenylethanolamine N-methyltransferase(Bos taurus (bovine))
University Of Kansas
Curated by ChEMBL
LigandPNGBDBM50024823(5-Methoxy-1,2,3,4-tetrahydro-1,4-methano-naphthale...)
Affinity DataKi:  1.10E+6nM. Assay description: In vitro inhibition of bovine phenylethylamine N-methyl-transferase (PNMT) using radiochemical assay.
In DepthDetails ArticlePubMed