BDBM50024838 9-Amino-1,2,3,4-tetrahydro-1,4-methano-naphthalen-5-ol::CHEMBL309111
SMILES N[C@H]1C2CCC1c1c2cccc1O
InChI Key InChIKey=YDBIMCUNUPTQML-AYVLWNQUSA-N
Data  1 KI
  Tab Delimited (TSV)   2D SDfile   Computed 3D by Vconf -m prep SDfile
Find this compound or compounds like it in BindingDB:
Activity Spreadsheet -- Enzyme Inhibition Constant Data from BindingDB
Found 1 hit for monomerid = 50024838
TargetPhenylethanolamine N-methyltransferase(Bos taurus (bovine))
University Of Kansas
Curated by ChEMBL
LigandPNGBDBM50024838(9-Amino-1,2,3,4-tetrahydro-1,4-methano-naphthalen-...)
Affinity DataKi: >4.00E+6nM. Assay description: In vitro inhibition of bovine phenylethylamine N-methyl-transferase (PNMT) using radiochemical assay.
In DepthDetails ArticlePubMed