BDBM50024842 9-Amino-1,2,3,4-tetrahydro-1,4-methano-naphthalen-6-ol::CHEMBL71563
SMILES N[C@H]1C2CCC1c1cc(O)ccc21
InChI Key InChIKey=NAOFMPIVMLVDMB-AMUVOQDHSA-N
Data  1 KI
  Tab Delimited (TSV)   2D SDfile   Computed 3D by Vconf -m prep SDfile
Find this compound or compounds like it in BindingDB:
Activity Spreadsheet -- Enzyme Inhibition Constant Data from BindingDB
Found 1 hit for monomerid = 50024842
TargetPhenylethanolamine N-methyltransferase(Bos taurus (bovine))
University Of Kansas
Curated by ChEMBL
LigandPNGBDBM50024842(9-Amino-1,2,3,4-tetrahydro-1,4-methano-naphthalen-...)
Affinity DataKi:  1.08E+5nM. Assay description: In vitro inhibition of bovine phenylethylamine N-methyl-transferase (PNMT) using radiochemical assay.
In DepthDetails ArticlePubMed