BDBM50025372 4,10,13-Trimethyl-3-oxo-octadecahydro-4-aza-cyclopropa[1,2]cyclopenta[a]phenanthrene-17-carboxylic acid diethylamide::CHEMBL2298402
SMILES CCN(CC)C(=O)[C@H]1CC[C@H]2[C@@H]3CC[C@H]4N(C)C(=O)[C@@H]5C[C@@H]5[C@]4(C)[C@H]3CC[C@]12C
InChI Key InChIKey=WNENMRZSIGSSCW-RZBOSLEQSA-N
Data  2 IC50
  Tab Delimited (TSV)   2D SDfile   Computed 3D by Vconf -m prep SDfile
Find this compound or compounds like it in BindingDB:
Activity Spreadsheet -- Enzyme Inhibition Constant Data from BindingDB
Found 2 hits for monomerid = 50025372
Target3-oxo-5-alpha-steroid 4-dehydrogenase 1/2(Rattus norvegicus)
TBA
Curated by ChEMBL
LigandPNGBDBM50025372(4,10,13-Trimethyl-3-oxo-octadecahydro-4-aza-cyclop...)
Affinity DataIC50:  20nM. Assay description: In vitro inhibitory activity against rat prostatic steroid 5-alpha-reductase
In DepthDetails ArticlePubMed
TargetAndrogen receptor(Rattus norvegicus (Rat))
TBA
Curated by ChEMBL
LigandPNGBDBM50025372(4,10,13-Trimethyl-3-oxo-octadecahydro-4-aza-cyclop...)
Affinity DataIC50:  2.70E+3nM. Assay description: In vitro antagonist activity against rat prostatic androgen receptor (AR)
In DepthDetails ArticlePubMed