BDBM50025381 1,4a,6a-Trimethyl-2-oxo-2,4a,4b,5,6,6a,7,8,9,9a,9b,10,11,11a-tetradecahydro-1H-indeno[5,4-f]quinoline-7-carboxylic acid methyl ester::CHEMBL3349134
SMILES [H][C@@]12CC[C@H](C(=O)OC)[C@@]1(C)CC[C@@]1([H])[C@@]2([H])CC[C@@]2([H])N(C)C(=O)C=C[C@]12C
InChI Key InChIKey=RYRGPLSUWGZYDE-PLTYFECRSA-N
Data  1 IC50
  Tab Delimited (TSV)   2D SDfile   Computed 3D by Vconf -m prep SDfile
Find this compound or compounds like it in BindingDB:
Activity Spreadsheet -- Enzyme Inhibition Constant Data from BindingDB
Found 1 hit for monomerid = 50025381
TargetAndrogen receptor(Rattus norvegicus (Rat))
TBA
Curated by ChEMBL
LigandPNGBDBM50025381(1,4a,6a-Trimethyl-2-oxo-2,4a,4b,5,6,6a,7,8,9,9a,9b...)
Affinity DataIC50:  13nM. Assay description: In vitro antagonist activity against rat prostatic androgen receptor (AR)
In DepthDetails ArticlePubMed