BDBM50026215 1-Cyclopropyl-1-(2-hydroxy-ethyl)-aziridinium; chloride::CHEMBL123573
SMILES OCC[N+]1(CC1)C1CC1
InChI Key InChIKey=DPWRTGUBEFWGJR-UHFFFAOYSA-N
Data  2 IC50
  Tab Delimited (TSV)   2D SDfile   Computed 3D by Vconf -m prep SDfile
Find this compound or compounds like it in BindingDB:
Activity Spreadsheet -- Enzyme Inhibition Constant Data from BindingDB
Found 2 hits for monomerid = 50026215
LigandPNGBDBM50026215(1-Cyclopropyl-1-(2-hydroxy-ethyl)-aziridinium; chl...)
Affinity DataIC50:  6.25E+3nM. Assay description: Compound was tested in vitro for its ability to displace [3H]-QNB from brain Muscarinic acetylcholine receptor by 50 %
In DepthDetails ArticlePubMed
TargetHigh affinity choline transporter 1(Mus musculus)
TBA
Curated by ChEMBL
LigandPNGBDBM50026215(1-Cyclopropyl-1-(2-hydroxy-ethyl)-aziridinium; chl...)
Affinity DataIC50:  3.90E+3nM. Assay description: Compound was evaluated in vitro for its ability to inhibit the transport of [3H]-choline in to high affinity choline transport system HAChT
In DepthDetails ArticlePubMed