BDBM50027026 1-Benzyl-4-(3-chloro-pyridin-2-yl)-piperazine::CHEMBL47471
SMILES Clc1cccnc1N1CCN(Cc2ccccc2)CC1
InChI Key InChIKey=DXBCZLBBXQSAMW-UHFFFAOYSA-N
Data  2 KI
  Tab Delimited (TSV)   2D SDfile   Computed 3D by Vconf -m prep SDfile
Find this compound or compounds like it in BindingDB:
Activity Spreadsheet -- Enzyme Inhibition Constant Data from BindingDB
Found 2 hits for monomerid = 50027026
TargetAlpha-2A adrenergic receptor(BOVINE)
TBA
Curated by ChEMBL
LigandPNGBDBM50027026(1-Benzyl-4-(3-chloro-pyridin-2-yl)-piperazine | CH...)
Affinity DataKi:  120nM. Assay description: Binding activity against alpha-2 adrenergic receptor from calf cerebral cortex, using [3H]-clonidine as the radioligand
In DepthDetails ArticlePubMed
TargetAlpha-1A adrenergic receptor(CALF)
TBA
Curated by ChEMBL
LigandPNGBDBM50027026(1-Benzyl-4-(3-chloro-pyridin-2-yl)-piperazine | CH...)
Affinity DataKi:  700nM. Assay description: Binding activity against alpha-1 adrenergic receptor from calf cerebral cortex, using [3H]-prazosin as the radioligand
In DepthDetails ArticlePubMed