BDBM50028120 2-Amino-1-methyl-1,7-dihydro-pyrrolo[2,3-d]pyrimidin-4-one::CHEMBL177312
SMILES Cn1c(N)nc(O)c2ccnc12
InChI Key InChIKey=LDIVGLFDBUNMHD-UHFFFAOYSA-N
Data  1 KI
  Tab Delimited (TSV)   2D SDfile   Computed 3D by Vconf -m prep SDfile
Find this compound or compounds like it in BindingDB:
Activity Spreadsheet -- Enzyme Inhibition Constant Data from BindingDB
Found 1 hit for monomerid = 50028120
TargetXanthine dehydrogenase/oxidase(Bos taurus (Bovine))
TBA
Curated by ChEMBL
LigandPNGBDBM50028120(2-Amino-1-methyl-1,7-dihydro-pyrrolo[2,3-d]pyrimid...)
Affinity DataKi:  4.50E+3nM. Assay description: Compound is evaluated for competitive inhibition against xanthine oxidase from cow's milk
In DepthDetails ArticlePubMed