BDBM50030261 CHEMBL3339228
SMILES CN[C@@H](C)C(=O)N[C@H](C(=O)N1C[C@H](C[C@H]1C(=O)N[C@@H]1CCCc2ccccc12)NC(=O)c1ccc(cc1)C(=O)Nc1ccc2C[C@H](N(Cc2c1)C(=O)[C@@H](NC(=O)[C@H](C)NC)C(C)(C)SCC(=O)NCCCN(CCCN(CCCCN(CCCNC(N)=N)C(N)=N)C(N)=N)C(N)=N)C(=O)N[C@@H]1CCCc2ccccc12)C(C)(C)C
InChI Key InChIKey=SLEYXAFJLKXZIB-ZLUZKAKLSA-N
Data  1 IC50
  Tab Delimited (TSV)   2D SDfile   Computed 3D by Vconf -m prep SDfile
Find this compound or compounds like it in BindingDB:
Activity Spreadsheet -- Enzyme Inhibition Constant Data from BindingDB
Found 1 hit for monomerid = 50030261
TargetE3 ubiquitin-protein ligase XIAP(Homo sapiens (Human))
Bristol-Myers Squibb Research & Development
Curated by ChEMBL
LigandPNGBDBM50030261(CHEMBL3339228)
Affinity DataIC50:  3.60nM. Assay description: Inhibition of XIAP-BIR3 (unknown origin) by HTRF assay
In DepthDetails ArticlePubMed