BDBM50031117 CHEMBL3357044
SMILES [#6]-[#6]-[#6]-[#6]-[#6]-[#6](=O)-[#7]-1-[#6]-[#6]\[#6](-[#6]-[#6]-1)=[#6]-1/c2ccc(Cl)cc2-[#6]-[#6]-c2cccnc-12
InChI Key InChIKey=CSARAAVLBATHMP-UHFFFAOYSA-N
Data  1 IC50
  Tab Delimited (TSV)   2D SDfile   Computed 3D by Vconf -m prep SDfile
Find this compound or compounds like it in BindingDB:
Activity Spreadsheet -- Enzyme Inhibition Constant Data from BindingDB
Found 1 hit for monomerid = 50031117
TargetSodium-dependent neutral amino acid transporter B(0)AT2(Homo sapiens (Human))
Max Planck Institute Of Psychiatry
Curated by ChEMBL
LigandPNGBDBM50031117(CHEMBL3357044)
Affinity DataIC50:  5.20E+3nM. Assay description: Inhibition of eGFP-tagged human B0AT2 expressed in HEK293 cells measured within 10 mins by [3H]proline uptake assay
In DepthDetails ArticlePubMed