BDBM50031258 5-(5-Chloro-7-cyclopentylamino-imidazo[4,5-b]pyridin-3-yl)-2-hydroxymethyl-tetrahydro-furan-3-ol::CHEMBL315709
SMILES OCC1OC(CC1O)n1cnc2c(NC3CCCC3)cc(Cl)nc12
InChI Key InChIKey=QHUNSJYFZSECMJ-UHFFFAOYSA-N
Data  1 KI
  Tab Delimited (TSV)   2D SDfile   Computed 3D by Vconf -m prep SDfile
Find this compound or compounds like it in BindingDB:
Activity Spreadsheet -- Enzyme Inhibition Constant Data from BindingDB
Found 1 hit for monomerid = 50031258
TargetAdenosine deaminase(Bos taurus (bovine))
Universit£
Curated by ChEMBL
LigandPNGBDBM50031258(5-(5-Chloro-7-cyclopentylamino-imidazo[4,5-b]pyrid...)
Affinity DataKi: >1.00E+5nM. Assay description: Inhibition calf intestine adenosine deaminase
In DepthDetails ArticlePubMed