BDBM50031272 CHEMBL128050::[5-(5-Chloro-7-cyclooctylamino-imidazo[4,5-b]pyridin-3-yl)-tetrahydro-furan-2-yl]-methanol
SMILES OCC1CCC(O1)n1cnc2c(NC3CCCCCCC3)cc(Cl)nc12
InChI Key InChIKey=QRRLQZHQBPJCFO-UHFFFAOYSA-N
Data  1 KI
  Tab Delimited (TSV)   2D SDfile   Computed 3D by Vconf -m prep SDfile
Find this compound or compounds like it in BindingDB:
Activity Spreadsheet -- Enzyme Inhibition Constant Data from BindingDB
Found 1 hit for monomerid = 50031272
TargetAdenosine deaminase(Bos taurus (bovine))
Universit£
Curated by ChEMBL
LigandPNGBDBM50031272(CHEMBL128050 | [5-(5-Chloro-7-cyclooctylamino-imid...)
Affinity DataKi: >1.00E+5nM. Assay description: Inhibition calf intestine adenosine deaminase
In DepthDetails ArticlePubMed