BDBM50031794 (R)-2-[4-(3,4-Dichloro-phenoxy)-butyl]-N*1*-((S)-2,2-dimethyl-1-methylcarbamoyl-propyl)-N*4*-hydroxy-succinamide::CHEMBL314051
SMILES CNC(=O)[C@@H](NC(=O)[C@H](CCCCOc1ccc(Cl)c(Cl)c1)CC(=O)NO)C(C)(C)C
InChI Key InChIKey=JTNPIFRUAXRHGD-FZKQIMNGSA-N
Data  2 KI
  Tab Delimited (TSV)   2D SDfile   Computed 3D by Vconf -m prep SDfile
Find this compound or compounds like it in BindingDB:
Activity Spreadsheet -- Enzyme Inhibition Constant Data from BindingDB
Found 2 hits for monomerid = 50031794
TargetStromelysin-1(Homo sapiens (Human))
Sterling Winthrop Pharmaceuticals Research Division
Curated by ChEMBL
LigandPNGBDBM50031794((R)-2-[4-(3,4-Dichloro-phenoxy)-butyl]-N*1*-((S)-2...)
Affinity DataKi:  62nM. Assay description: Inhibitory potency against human stromelysin, MMP-3
In DepthDetails ArticlePubMed
TargetInterstitial collagenase(Homo sapiens (Human))
Sterling Winthrop Pharmaceuticals Research Division
Curated by ChEMBL
LigandPNGBDBM50031794((R)-2-[4-(3,4-Dichloro-phenoxy)-butyl]-N*1*-((S)-2...)
Affinity DataKi:  95nM. Assay description: Inhibitory potency against human fibroblast collagenase, MMP-1
In DepthDetails ArticlePubMed