BDBM50031902 (1S,9aR,11aS)-9a,11a-Dimethyl-7-oxo-2,3,3a,3b,4,5,7,8,9,9a,9b,10,11,11a-tetradecahydro-1H-cyclopenta[i]phenanthridine-1-carboxylic acid (2-tert-butyl-5-chloro-phenyl)-amide::CHEMBL87021
SMILES CC(C)(C)c1ccc(Cl)cc1NC(=O)[C@H]1CCC2C3CN=C4CC(=O)CC[C@]4(C)C3CC[C@]12C
InChI Key InChIKey=YIFKYULSDLYQLN-WBDNBOLYSA-N
Data  1 KI
  Tab Delimited (TSV)   2D SDfile   Computed 3D by Vconf -m prep SDfile
Find this compound or compounds like it in BindingDB:
Activity Spreadsheet -- Enzyme Inhibition Constant Data from BindingDB
Found 1 hit for monomerid = 50031902
Target3-oxo-5-alpha-steroid 4-dehydrogenase 1(Homo sapiens (Human))
Glaxo Inc. Research Institute
Curated by ChEMBL
LigandPNGBDBM50031902((1S,9aR,11aS)-9a,11a-Dimethyl-7-oxo-2,3,3a,3b,4,5,...)
Affinity DataKi:  7.5nM. Assay description: Inhibition of recombinant steroid 5-alpha-reductase type I
In DepthDetails ArticlePubMed