BDBM50033073 4-[1-(5,5,8,8-Tetramethyl-5,6,7,8-tetrahydro-naphthalen-2-yl)-ethyl]-benzoic acid::CHEMBL115763
SMILES CC(c1ccc(cc1)C(O)=O)c1ccc2c(c1)C(C)(C)CCC2(C)C
InChI Key InChIKey=SEPMSBSPXGWXQU-UHFFFAOYSA-N
Data  2 EC50
  Tab Delimited (TSV)   2D SDfile   Computed 3D by Vconf -m prep SDfile
Find this compound or compounds like it in BindingDB:
Activity Spreadsheet -- Enzyme Inhibition Constant Data from BindingDB
Found 2 hits for monomerid = 50033073
TargetRetinoic acid receptor RXR-beta(Homo sapiens (Human))
Sri International
Curated by ChEMBL
LigandPNGBDBM50033073(4-[1-(5,5,8,8-Tetramethyl-5,6,7,8-tetrahydro-napht...)
Affinity DataEC50:  500nM. Assay description: Effective concentrations against Retinoic acid receptor RXR-beta
In DepthDetails ArticlePubMed
TargetRetinoic acid receptor RXR-alpha(Homo sapiens (Human))
Sri International
Curated by ChEMBL
LigandPNGBDBM50033073(4-[1-(5,5,8,8-Tetramethyl-5,6,7,8-tetrahydro-napht...)
Affinity DataEC50:  300nM. Assay description: Effective concentration against Retinoic acid receptor RXR-alpha
In DepthDetails ArticlePubMed