BDBM50033240 1-Methyl-5-[4-(2-methyl-imidazo[4,5-c]pyridin-1-yl)-phenyl]-3-phenyl-6,8-dihydro-1H-pyrazolo[3,4-b][1,4]diazepin-7-one::CHEMBL327034
SMILES Cc1nc2cnccc2n1-c1ccc(cc1)C1=Nc2c(NC(=O)C1)n(C)nc2-c1ccccc1
InChI Key InChIKey=XTADTKNIFZSDMZ-UHFFFAOYSA-N
Data  1 IC50
  Tab Delimited (TSV)   2D SDfile   Computed 3D by Vconf -m prep SDfile
Find this compound or compounds like it in BindingDB:
Activity Spreadsheet -- Enzyme Inhibition Constant Data from BindingDB
Found 1 hit for monomerid = 50033240
TargetPlatelet-activating factor receptor(Cavia porcellus)
Pfizer
Curated by ChEMBL
LigandPNGBDBM50033240(1-Methyl-5-[4-(2-methyl-imidazo[4,5-c]pyridin-1-yl...)
Affinity DataIC50:  0.600nM. Assay description: In vitro antagonist activity against platelet activating factor (PAF) receptor, using washed rabbit platelets
In DepthDetails ArticlePubMed