BDBM50034523 CHEMBL3359282
SMILES [H][C@@]12CC[C@@]3(C)[C@@H](C[C@H](OC(C)=O)C(=O)[C@]3([H])[C@@]1(C)C[C@H](OC2=O)c1ccoc1-c1ccc(F)cc1)C(=O)OC
InChI Key InChIKey=SJWWUGYQUJSWKQ-MGRBCCQOSA-N
Data  1 EC50
  Tab Delimited (TSV)   2D SDfile   Computed 3D by Vconf -m prep SDfile
Find this compound or compounds like it in BindingDB:
Activity Spreadsheet -- Enzyme Inhibition Constant Data from BindingDB
Found 1 hit for monomerid = 50034523
TargetKappa-type opioid receptor(Homo sapiens (Human))
The University Of Kansas
Curated by ChEMBL
LigandPNGBDBM50034523(CHEMBL3359282)
Affinity DataEC50:  54nM. Assay description: Agonist activity at human KOR expressed in CHO cells assessed as inhibition of forskolin-induced cAMP accumulation after 30 mins by luminescence assa...
In DepthDetails ArticlePubMed