BDBM50035007 5,N*2*,N*6*-Trimethyl-N*6*-pyridazin-4-ylmethyl-benzo[cd]indole-2,6-diamine::CHEMBL293810
SMILES CNC1=Nc2ccc(N(C)Cc3ccnnc3)c3c(C)ccc1c23
InChI Key InChIKey=CPWZSKZUQLEOBO-UHFFFAOYSA-N
Data  1 KI
  Tab Delimited (TSV)   2D SDfile   Computed 3D by Vconf -m prep SDfile
Find this compound or compounds like it in BindingDB:
Activity Spreadsheet -- Enzyme Inhibition Constant Data from BindingDB
Found 1 hit for monomerid = 50035007
TargetThymidylate synthase(Homo sapiens (Human))
Agouron Pharmaceuticals
Curated by ChEMBL
LigandPNGBDBM50035007(5,N*2*,N*6*-Trimethyl-N*6*-pyridazin-4-ylmethyl-be...)
Affinity DataKi:  30nM. Assay description: Inhibitory effect against recombinant human thymidylate synthase
In DepthDetails ArticlePubMed