BDBM50036610 CHEMBL3354264
SMILES COc1ccc(CNc2nc(OCc3ccccn3)ncc2C(=O)OCc2ccccn2)cc1Cl
InChI Key InChIKey=PQWWTBKSLNIILE-UHFFFAOYSA-N
Data  2 IC50
  Tab Delimited (TSV)   2D SDfile   Computed 3D by Vconf -m prep SDfile
Find this compound or compounds like it in BindingDB:
Activity Spreadsheet -- Enzyme Inhibition Constant Data from BindingDB
Found 2 hits for monomerid = 50036610
TargetcGMP-specific 3',5'-cyclic phosphodiesterase(Homo sapiens (Human))
Cairo University
Curated by ChEMBL
LigandPNGBDBM50036610(CHEMBL3354264)
Affinity DataIC50:  2.10E+3nM. Assay description: Inhibition of PDE5 (unknown origin)
In DepthDetails ArticlePubMed
TargetcGMP-specific 3',5'-cyclic phosphodiesterase(Canis lupus familiaris)
Mitsubishi Tanabe Pharma
Curated by ChEMBL
LigandPNGBDBM50036610(CHEMBL3354264)
Affinity DataIC50:  2.10nM. Assay description: Inhibition of dog lungs PDE5 using [3H]cGMP as substrate after 30 mins by scintillation counting analysis
In DepthDetails ArticlePubMed