BDBM50037896 CHEMBL3358258
SMILES CCOc1cc(ccc1OC)C(=O)NC(Cc1ccc(cc1)-c1cccc(c1)C(F)(F)F)C(=O)NCCN(C)C
InChI Key InChIKey=VBZLFDDSJUUBFH-UHFFFAOYSA-N
Data  1 IC50
  Tab Delimited (TSV)   2D SDfile   Computed 3D by Vconf -m prep SDfile
Find this compound or compounds like it in BindingDB:
Activity Spreadsheet -- Enzyme Inhibition Constant Data from BindingDB
Found 1 hit for monomerid = 50037896
TargetKinesin-like protein KIFC1(Homo sapiens (Human))
Astrazeneca
Curated by ChEMBL
LigandPNGBDBM50037896(CHEMBL3358258)
Affinity DataIC50:  1.30E+3nM. Assay description: Inhibition of recombinant N-terminal His6-tagged KIFC1 (Q305-K673 aa) (unknown origin) expressed in Escherichia coli BL21 (DE3) by malachite green as...
In DepthDetails ArticlePubMed