BDBM50038917 1-[6-Chloro-4-(4-methoxy-phenyl)-quinolin-3-yl]-3-(2,4-difluoro-phenyl)-urea::CHEMBL278042
SMILES COc1ccc(cc1)-c1c(NC(=O)Nc2ccc(F)cc2F)cnc2ccc(Cl)cc12
InChI Key InChIKey=VTABNCCHKYTPIF-UHFFFAOYSA-N
Data  1 IC50
  Tab Delimited (TSV)   2D SDfile   Computed 3D by Vconf -m prep SDfile
Find this compound or compounds like it in BindingDB:
Activity Spreadsheet -- Enzyme Inhibition Constant Data from BindingDB
Found 1 hit for monomerid = 50038917
TargetSterol O-acyltransferase 1(Rattus norvegicus)
Takeda Chemical Industries
Curated by ChEMBL
LigandPNGBDBM50038917(1-[6-Chloro-4-(4-methoxy-phenyl)-quinolin-3-yl]-3-...)
Affinity DataIC50:  121nM. Assay description: Inhibitory activity against acyl coenzyme A:cholesterol acyltransferase in rat microsomes
In DepthDetails ArticlePubMed