BDBM50039 MLS000093549::N-[4-(dimethylamino)phenyl]-2-(1-keto-[1,2,4]triazin[4,5-a]indol-2-yl)acetamide::N-[4-(dimethylamino)phenyl]-2-(1-oxidanylidene-[1,2,4]triazino[4,5-a]indol-2-yl)ethanamide::N-[4-(dimethylamino)phenyl]-2-(1-oxo-[1,2,4]triazino[4,5-a]indol-2-yl)acetamide::N-[4-(dimethylamino)phenyl]-2-(1-oxo[1,2,4]triazino[4,5-a]indol-2(1H)-yl)acetamide::SMR000029167::cid_3244843
SMILES CN(C)c1ccc(NC(=O)Cn2ncn3c4ccccc4cc3c2=O)cc1
InChI Key InChIKey=PNCFCEUAEBGJQO-UHFFFAOYSA-N
Data  2 IC50
  Tab Delimited (TSV)   2D SDfile   Computed 3D by Vconf -m prep SDfile
Find this compound or compounds like it in BindingDB:
Activity Spreadsheet -- Enzyme Inhibition Constant Data from BindingDB
Found 1 hit for monomerid = 50039
TargetLarge T antigen(Simian virus 40)
Southern Research Specialized Biocontainment Screening Center
Curated by PubChem BioAssay
LigandPNGBDBM50039(MLS000093549 | N-[4-(dimethylamino)phenyl]-2-(1-ke...)
Affinity DataIC50:  2.96E+4nM. Assay description: A biochemical assay using the ADP-Hunter methodology, purified TAg, and ATP to identify compounds that inhibit the ATPase activity of Tag Southern Re...
In DepthDetails PCBioAssay