BDBM50039187 1-Phenyl-cyclopropanecarboxylic acid 2-(2-diethylamino-ethoxy)-ethyl ester::CHEMBL73762
SMILES CCN(CC)CCOCCOC(=O)C1(CC1)c1ccccc1
InChI Key InChIKey=JEGFGHFALZOCIB-UHFFFAOYSA-N
Data  3 KI
  Tab Delimited (TSV)   2D SDfile   Computed 3D by Vconf -m prep SDfile
Find this compound or compounds like it in BindingDB:
Activity Spreadsheet -- Enzyme Inhibition Constant Data from BindingDB
Found 3 hits for monomerid = 50039187
TargetSigma non-opioid intracellular receptor 1(RAT)
National Institute On Drug Abuse-Intramural Research Program
Curated by ChEMBL
LigandPNGBDBM50039187(1-Phenyl-cyclopropanecarboxylic acid 2-(2-diethyla...)
Affinity DataKi:  45nM. Assay description: Tested for its binding affinity towards sigma-1 site in rat brain using E3H1-(+)-SKF 10047 as radioligand in rat brain
In DepthDetails ArticlePubMed
TargetMuscarinic acetylcholine receptor M1(Homo sapiens (Human))
National Institute On Drug Abuse-Intramural Research Program
Curated by ChEMBL
LigandPNGBDBM50039187(1-Phenyl-cyclopropanecarboxylic acid 2-(2-diethyla...)
Affinity DataKi: >1.00E+4nM. Assay description: Binding affinity towards muscarinic m1 receptor
In DepthDetails ArticlePubMed
TargetMuscarinic acetylcholine receptor M2(Homo sapiens (Human))
National Institute On Drug Abuse-Intramural Research Program
Curated by ChEMBL
LigandPNGBDBM50039187(1-Phenyl-cyclopropanecarboxylic acid 2-(2-diethyla...)
Affinity DataKi: >1.00E+4nM. Assay description: Binding affinity towards muscarinic m2 receptor
In DepthDetails ArticlePubMed