BDBM50039284 (1S,9aR,11aS)-9a,11a-Dimethyl-1-(thiomorpholine-4-carbonyl)-1,2,3,3a,3b,4,5,8,9,9a,9b,10,11,11a-tetradecahydro-cyclopenta[i]phenanthridin-7-one::9a,11a-Dimethyl-1-(thiomorpholine-4-carbonyl)-1,2,3,3a,3b,4,5,8,9,9a,9b,10,11,11a-tetradecahydro-cyclopenta[i]phenanthridin-7-one::CHEMBL73816
SMILES C[C@]12CCC3C(CN=C4CC(=O)CC[C@]34C)C1CC[C@@H]2C(=O)N1CCSCC1
InChI Key InChIKey=QLGRLIPMYCDDEH-PAJIOFOTSA-N
Data  2 KI  2 IC50
  Tab Delimited (TSV)   2D SDfile   Computed 3D by Vconf -m prep SDfile
Find this compound or compounds like it in BindingDB:
Activity Spreadsheet -- Enzyme Inhibition Constant Data from BindingDB
Found 4 hits for monomerid = 50039284
Target3-oxo-5-alpha-steroid 4-dehydrogenase 1(Homo sapiens (Human))
Glaxo Inc. Research Institute
Curated by ChEMBL
LigandPNGBDBM50039284((1S,9aR,11aS)-9a,11a-Dimethyl-1-(thiomorpholine-4-...)
Affinity DataKi:  570nM. Assay description: Inhibition of recombinant human 5-alpha reductase-1 at a concentration of 5 microL after preincubation for 10 minutes
In DepthDetails ArticlePubMed
Target3-oxo-5-alpha-steroid 4-dehydrogenase 1(Homo sapiens (Human))
Glaxo Inc. Research Institute
Curated by ChEMBL
LigandPNGBDBM50039284((1S,9aR,11aS)-9a,11a-Dimethyl-1-(thiomorpholine-4-...)
Affinity DataKi:  570nM. Assay description: In vitro inhibitory activity against human type 1 5-alpha reductase
In DepthDetails ArticlePubMed
Target3-oxo-5-alpha-steroid 4-dehydrogenase 2(Homo sapiens (Human))
Glaxo Inc. Research Institute
Curated by ChEMBL
LigandPNGBDBM50039284((1S,9aR,11aS)-9a,11a-Dimethyl-1-(thiomorpholine-4-...)
Affinity DataIC50:  1.30nM. Assay description: In vitro inhibitory activity against human type 2 5-alpha reductase
In DepthDetails ArticlePubMed
Target3-oxo-5-alpha-steroid 4-dehydrogenase 2(Homo sapiens (Human))
Glaxo Inc. Research Institute
Curated by ChEMBL
LigandPNGBDBM50039284((1S,9aR,11aS)-9a,11a-Dimethyl-1-(thiomorpholine-4-...)
Affinity DataIC50:  1.30nM. Assay description: Inhibition of recombinant human 5-alpha reductase-2 at a concentration of 5 microL after preincubation for 10 minutes
In DepthDetails ArticlePubMed