BDBM50039291 (1S,9aR,11aS)-6-Chloro-9a,11a-dimethyl-7-oxo-2,3,3a,3b,4,5,7,8,9,9a,9b,10,11,11a-tetradecahydro-1H-cyclopenta[i]phenanthridine-1-carboxylic acid diethylamide::CHEMBL432729
SMILES CCN(CC)C(=O)[C@H]1CCC2C3CN=C4C(Cl)C(=O)CC[C@]4(C)C3CC[C@]12C
InChI Key InChIKey=OHRASUAMJFROSS-XTZOOUNBSA-N
Data  1 KI  1 IC50
  Tab Delimited (TSV)   2D SDfile   Computed 3D by Vconf -m prep SDfile
Find this compound or compounds like it in BindingDB:
Activity Spreadsheet -- Enzyme Inhibition Constant Data from BindingDB
Found 2 hits for monomerid = 50039291
Target3-oxo-5-alpha-steroid 4-dehydrogenase 1(Homo sapiens (Human))
Glaxo Inc. Research Institute
Curated by ChEMBL
LigandPNGBDBM50039291((1S,9aR,11aS)-6-Chloro-9a,11a-dimethyl-7-oxo-2,3,3...)
Affinity DataKi:  51nM. Assay description: In vitro inhibitory activity against human type 1 5-alpha reductase
In DepthDetails ArticlePubMed
Target3-oxo-5-alpha-steroid 4-dehydrogenase 2(Homo sapiens (Human))
Glaxo Inc. Research Institute
Curated by ChEMBL
LigandPNGBDBM50039291((1S,9aR,11aS)-6-Chloro-9a,11a-dimethyl-7-oxo-2,3,3...)
Affinity DataIC50:  1.90nM. Assay description: In vitro inhibitory activity against human type 2 5-alpha reductase
In DepthDetails ArticlePubMed