BDBM50039305 (1S,9aR,11aS)-9a,11a-Dimethyl-7-oxo-5-propyl-2,3,3a,3b,4,5,7,9a,9b,10,11,11a-dodecahydro-1H-cyclopenta[i]phenanthridine-1-carboxylic acid benzhydryl-amide::CHEMBL309585
SMILES CCCN1CC2C3CC[C@H](C(=O)NC(c4ccccc4)c4ccccc4)[C@@]3(C)CCC2[C@@]2(C)C=CC(=O)C=C12
InChI Key InChIKey=RAHAEYSVRGAPDR-PGXHHHFUSA-N
Data  1 KI  1 IC50
  Tab Delimited (TSV)   2D SDfile   Computed 3D by Vconf -m prep SDfile
Find this compound or compounds like it in BindingDB:
Activity Spreadsheet -- Enzyme Inhibition Constant Data from BindingDB
Found 2 hits for monomerid = 50039305
Target3-oxo-5-alpha-steroid 4-dehydrogenase 1(Homo sapiens (Human))
Glaxo Inc. Research Institute
Curated by ChEMBL
LigandPNGBDBM50039305((1S,9aR,11aS)-9a,11a-Dimethyl-7-oxo-5-propyl-2,3,3...)
Affinity DataKi:  340nM. Assay description: In vitro inhibitory activity against human type 1 5-alpha reductase
In DepthDetails ArticlePubMed
Target3-oxo-5-alpha-steroid 4-dehydrogenase 2(Homo sapiens (Human))
Glaxo Inc. Research Institute
Curated by ChEMBL
LigandPNGBDBM50039305((1S,9aR,11aS)-9a,11a-Dimethyl-7-oxo-5-propyl-2,3,3...)
Affinity DataIC50:  1.30nM. Assay description: In vitro inhibitory activity against human type 2 5-alpha reductase
In DepthDetails ArticlePubMed