BDBM50039309 (1S,9aR,11aS)-5,9a,11a-Trimethyl-7-oxo-2,3,3a,3b,4,5,7,9a,9b,10,11,11a-dodecahydro-1H-cyclopenta[i]phenanthridine-1-carboxylic acid tert-butylamide::CHEMBL306507
SMILES CN1CC2C3CC[C@H](C(=O)NC(C)(C)C)[C@@]3(C)CCC2[C@@]2(C)C=CC(=O)C=C12
InChI Key InChIKey=RUCGACIRHPJZEV-FNGIOQARSA-N
Data  1 KI  1 IC50
  Tab Delimited (TSV)   2D SDfile   Computed 3D by Vconf -m prep SDfile
Find this compound or compounds like it in BindingDB:
Activity Spreadsheet -- Enzyme Inhibition Constant Data from BindingDB
Found 2 hits for monomerid = 50039309
Target3-oxo-5-alpha-steroid 4-dehydrogenase 1(Homo sapiens (Human))
Glaxo Inc. Research Institute
Curated by ChEMBL
LigandPNGBDBM50039309((1S,9aR,11aS)-5,9a,11a-Trimethyl-7-oxo-2,3,3a,3b,4...)
Affinity DataKi:  1.40E+3nM. Assay description: In vitro inhibitory activity against human type 1 5-alpha reductase
In DepthDetails ArticlePubMed
Target3-oxo-5-alpha-steroid 4-dehydrogenase 2(Homo sapiens (Human))
Glaxo Inc. Research Institute
Curated by ChEMBL
LigandPNGBDBM50039309((1S,9aR,11aS)-5,9a,11a-Trimethyl-7-oxo-2,3,3a,3b,4...)
Affinity DataIC50:  6.70nM. Assay description: In vitro inhibitory activity against human type 2 5-alpha reductase
In DepthDetails ArticlePubMed