BDBM50040958 CHEMBL3354461
SMILES COc1ccc(cc1)-c1cnco1
InChI Key InChIKey=WWTDBJIWQKDBSY-UHFFFAOYSA-N
Data  4 EC50
  Tab Delimited (TSV)   2D SDfile   Computed 3D by Vconf -m prep SDfile
Find this compound or compounds like it in BindingDB:
Activity Spreadsheet -- Enzyme Inhibition Constant Data from BindingDB
Found 4 hits for monomerid = 50040958
TargetD-amino-acid oxidase(Caenorhabditis elegans)
Kitasato University
Curated by ChEMBL
LigandPNGBDBM50040958(CHEMBL3354461)
Affinity DataEC50: >1.00E+5nM. Assay description: Inhibition of Caenorhabditis elegans DAO incubated for 10 mins
In DepthDetails ArticlePubMed
TargetD-aspartate oxidase 3(Caenorhabditis elegans)
Kitasato University
Curated by ChEMBL
LigandPNGBDBM50040958(CHEMBL3354461)
Affinity DataEC50: >1.00E+5nM. Assay description: Inhibition of Caenorhabditis elegans DDO3 incubated for 10 mins
In DepthDetails ArticlePubMed
TargetD-aspartate oxidase 1(Caenorhabditis elegans)
Kitasato University
Curated by ChEMBL
LigandPNGBDBM50040958(CHEMBL3354461)
Affinity DataEC50: >1.00E+5nM. Assay description: Inhibition of Caenorhabditis elegans DDO2 incubated for 10 mins
In DepthDetails ArticlePubMed
TargetD-aspartate oxidase 2(Caenorhabditis elegans)
Kitasato University
Curated by ChEMBL
LigandPNGBDBM50040958(CHEMBL3354461)
Affinity DataEC50: >1.00E+5nM. Assay description: Inhibition of Caenorhabditis elegans DDO1 incubated for 10 mins
In DepthDetails ArticlePubMed