BDBM50041726 1-(2,6-Diisopropyl-phenyl)-3-[1-(4-isopropyl-phenyl)-cyclopentylmethyl]-urea::CHEMBL44266
SMILES CC(C)c1ccc(cc1)C1(CNC(=O)Nc2c(cccc2C(C)C)C(C)C)CCCC1
InChI Key InChIKey=KBEYXMLRWVVRFI-UHFFFAOYSA-N
Data  1 IC50
  Tab Delimited (TSV)   2D SDfile   Computed 3D by Vconf -m prep SDfile
Find this compound or compounds like it in BindingDB:
Activity Spreadsheet -- Enzyme Inhibition Constant Data from BindingDB
Found 1 hit for monomerid = 50041726
TargetAcyl-CoA:cholesterol acyltransferase(Oryctolagus cuniculus)
Warner-Lambert
Curated by ChEMBL
LigandPNGBDBM50041726(1-(2,6-Diisopropyl-phenyl)-3-[1-(4-isopropyl-pheny...)
Affinity DataIC50:  48nM. Assay description: Tested for in vitro inhibition against Acyl coenzyme A:cholesterol acyltransferase of intestinal microsomes in cholesterol-fed rabbits
In DepthDetails ArticlePubMed