BDBM50044414 2-Ethylamino-3-[2'-(1H-tetrazol-5-yl)-biphenyl-4-ylmethyl]-3H-benzoimidazole-4-carboxylic acid::CHEMBL71410
SMILES CCNc1nc2cccc(C(O)=O)c2n1Cc1ccc(cc1)-c1ccccc1-c1nnn[nH]1
InChI Key InChIKey=APMNCEGMCPPDAT-UHFFFAOYSA-N
Data  1 IC50
  Tab Delimited (TSV)   2D SDfile   Computed 3D by Vconf -m prep SDfile
Find this compound or compounds like it in BindingDB:
Activity Spreadsheet -- Enzyme Inhibition Constant Data from BindingDB
Found 1 hit for monomerid = 50044414
TargetType-1 angiotensin II receptor(Bos taurus)
Takeda Chemical Industries
Curated by ChEMBL
LigandPNGBDBM50044414(2-Ethylamino-3-[2'-(1H-tetrazol-5-yl)-biphenyl-4-y...)
Affinity DataIC50:  62nM. Assay description: Inhibition of specific binding of [125 I ] Angiotensin-II (0.2 nM) to bovine adrenal cortex
In DepthDetails ArticlePubMed