BDBM50045190 CHEMBL3310699
SMILES [H][C@@]12CCC[C@]1([H])[C@H](C(CC(C(=O)OC)C(=O)OC)=NO2)c1ccccc1
InChI Key InChIKey=KMDLRMQGZFIKLR-IAOVAPTHSA-N
Data  1 IC50
  Tab Delimited (TSV)   2D SDfile   Computed 3D by Vconf -m prep SDfile
Find this compound or compounds like it in BindingDB:
Activity Spreadsheet -- Enzyme Inhibition Constant Data from BindingDB
Found 1 hit for monomerid = 50045190
TargetAcetylcholinesterase(Homo sapiens (Human))
N.D. Zelinsky Institute Of Organic Chemistry
Curated by ChEMBL
LigandPNGBDBM50045190(CHEMBL3310699)
Affinity DataIC50:  7.54E+4nM. Assay description: Inhibition of AChE (unknown origin) using ACh chloride as substrate preincubated for 15 mins before substrate addition by Ellman method
In DepthDetails ArticlePubMed