BDBM50045922 5-[2-(3-Hydroxy-phenyl)-vinyl]-benzene-1,3-diol::CHEMBL99852
SMILES Oc1cccc(\C=C\c2cc(O)cc(O)c2)c1
InChI Key InChIKey=QUGCFFKLKWANMQ-SNAWJCMRSA-N
Data  2 IC50  1 EC50
  Tab Delimited (TSV)   2D SDfile   Computed 3D by Vconf -m prep SDfile
Find this compound or compounds like it in BindingDB:
Activity Spreadsheet -- Enzyme Inhibition Constant Data from BindingDB
Found 1 hit for monomerid = 50045922
TargetTyrosine-protein kinase Lck(Homo sapiens (Human))
Purdue University
Curated by ChEMBL
LigandPNGBDBM50045922(5-[2-(3-Hydroxy-phenyl)-vinyl]-benzene-1,3-diol | ...)
Affinity DataIC50:  1.70E+4nM. Assay description: Tested in vitro for the inhibition of protein-tyrosine kinase p56lck using angiotensin I (1.2 mM) and [gamma-32P]-ATP (50 pM)
In DepthDetails ArticlePubMed