BDBM50046577 CHEMBL3314465
SMILES Fc1ccc(cc1C(F)(F)F)-c1nc(cs1)-c1ccc2[nH]c(=O)oc2c1
InChI Key InChIKey=LSAUNCSQVBKUGD-UHFFFAOYSA-N
Data  1 IC50
  Tab Delimited (TSV)   2D SDfile   Computed 3D by Vconf -m prep SDfile
Find this compound or compounds like it in BindingDB:
Activity Spreadsheet -- Enzyme Inhibition Constant Data from BindingDB
Found 1 hit for monomerid = 50046577
TargetProtein phosphatase 1D(Homo sapiens (Human))
The Institute Of Cancer Research
Curated by ChEMBL
LigandPNGBDBM50046577(CHEMBL3314465)
Affinity DataIC50: <2.00E+4nM. Assay description: Inhibition of PPM1D (unknown origin) phosphatase activity using peptide substrate TDDEMT*GY*VAT by malachite green/molybdate based assay
In DepthDetails ArticlePubMed