BDBM50046586 (2-Allylamino-8-methoxy-1,2,3,4-tetrahydro-naphthalen-1-yl)-methanol::CHEMBL158582
SMILES COc1cccc2CC[C@@H](NCC=C)[C@@H](CO)c12
InChI Key InChIKey=KXAPNAIRVGHCCW-CHWSQXEVSA-N
Data  1 KI
  Tab Delimited (TSV)   2D SDfile   Computed 3D by Vconf -m prep SDfile
Find this compound or compounds like it in BindingDB:
Activity Spreadsheet -- Enzyme Inhibition Constant Data from BindingDB
Found 1 hit for monomerid = 50046586
Target5-hydroxytryptamine receptor 1A(Homo sapiens (Human))
Upjohn Laboratories
Curated by ChEMBL
LigandPNGBDBM50046586((2-Allylamino-8-methoxy-1,2,3,4-tetrahydro-naphtha...)
Affinity DataKi:  2nM. Assay description: In vivo binding affinity towards [3H]-8-OH-DPAT-labeled 5-hydroxytryptamine 1A receptor sites in bovine hippocampus.
In DepthDetails ArticlePubMed