BDBM50046654 2-Amino-6-methyl-5-(2-trifluoromethyl-pyridin-4-ylsulfanyl)-3H-quinazolin-4-one::CHEMBL351885
SMILES Cc1ccc2nc(N)[nH]c(=O)c2c1Sc1ccnc(c1)C(F)(F)F
InChI Key InChIKey=DPCVHBNVZHAFBU-UHFFFAOYSA-N
Data  2 KI
  Tab Delimited (TSV)   2D SDfile   Computed 3D by Vconf -m prep SDfile
Find this compound or compounds like it in BindingDB:
Activity Spreadsheet -- Enzyme Inhibition Constant Data from BindingDB
Found 2 hits for monomerid = 50046654
TargetThymidylate synthase(Homo sapiens (Human))
Agouron Pharmaceuticals
Curated by ChEMBL
LigandPNGBDBM50046654(2-Amino-6-methyl-5-(2-trifluoromethyl-pyridin-4-yl...)
Affinity DataKi:  24nM. Assay description: Inhibition of human Thymidylate synthase
In DepthDetails ArticlePubMed
TargetThymidylate synthase(Homo sapiens (Human))
Agouron Pharmaceuticals
Curated by ChEMBL
LigandPNGBDBM50046654(2-Amino-6-methyl-5-(2-trifluoromethyl-pyridin-4-yl...)
Affinity DataKi:  28nM. Assay description: Inhibition of human Thymidylate synthase
In DepthDetails ArticlePubMed