BDBM50046986 Acetic acid 1,4-bis-(3,4,5-trimethoxy-benzoyl)-piperazin-2-ylmethyl ester::CHEMBL6217
SMILES COc1cc(cc(OC)c1OC)C(=O)N1CCN(C(COC(C)=O)C1)C(=O)c1cc(OC)c(OC)c(OC)c1
InChI Key InChIKey=KRGMLTJKLQEHOZ-UHFFFAOYSA-N
Data  1 IC50  1 EC50
  Tab Delimited (TSV)   2D SDfile   Computed 3D by Vconf -m prep SDfile
Find this compound or compounds like it in BindingDB:
Activity Spreadsheet -- Enzyme Inhibition Constant Data from BindingDB
Found 2 hits for monomerid = 50046986
TargetPlatelet-activating factor receptor(Cavia porcellus)
Universit£
Curated by ChEMBL
LigandPNGBDBM50046986(Acetic acid 1,4-bis-(3,4,5-trimethoxy-benzoyl)-pip...)
Affinity DataEC50:  400nM. Assay description: Inhibition of [3H]PAF binding to rabbit platelet membrane
In DepthDetails ArticlePubMed
TargetPlatelet-activating factor receptor(Cavia porcellus)
Universit£
Curated by ChEMBL
LigandPNGBDBM50046986(Acetic acid 1,4-bis-(3,4,5-trimethoxy-benzoyl)-pip...)
Affinity DataIC50:  430nM. Assay description: Inhibition of PAF-induced rabbit platelet aggregation
In DepthDetails ArticlePubMed