BDBM50046991 (1,4-bis(3,4,5-trimethoxybenzoyl)piperazin-2-yl)methyl dipropylcarbamate::CHEMBL269131::Dipropyl-carbamic acid 1,4-bis-(3,4,5-trimethoxy-benzoyl)-piperazin-2-ylmethyl ester
SMILES CCCN(CCC)C(=O)OCC1CN(CCN1C(=O)c1cc(OC)c(OC)c(OC)c1)C(=O)c1cc(OC)c(OC)c(OC)c1
InChI Key InChIKey=HZWQZAAOTLGOMR-UHFFFAOYSA-N
Data  1 IC50  1 EC50
  Tab Delimited (TSV)   2D SDfile   Computed 3D by Vconf -m prep SDfile
Find this compound or compounds like it in BindingDB:
Activity Spreadsheet -- Enzyme Inhibition Constant Data from BindingDB
Found 2 hits for monomerid = 50046991
TargetPlatelet-activating factor receptor(Cavia porcellus)
Universit£
Curated by ChEMBL
LigandPNGBDBM50046991((1,4-bis(3,4,5-trimethoxybenzoyl)piperazin-2-yl)me...)
Affinity DataIC50:  380nM. Assay description: Inhibition of PAF-induced rabbit platelet aggregation
In DepthDetails ArticlePubMed
TargetPlatelet-activating factor receptor(Cavia porcellus)
Universit£
Curated by ChEMBL
LigandPNGBDBM50046991((1,4-bis(3,4,5-trimethoxybenzoyl)piperazin-2-yl)me...)
Affinity DataEC50:  680nM. Assay description: Inhibition of [3H]PAF binding to rabbit platelet membrane
In DepthDetails ArticlePubMed