BDBM50047559 1-(2,2-Dimethyl-propyl)-3-{2-[3-(5-ethyl-4-phenyl-imidazol-1-yl)-propoxy]-6-methyl-phenyl}-urea::CHEMBL296852
SMILES CCc1c(ncn1CCCOc1cccc(C)c1NC(=O)NCC(C)(C)C)-c1ccccc1
InChI Key InChIKey=LLSUZIXNIHAHDI-UHFFFAOYSA-N
Data  2 IC50
  Tab Delimited (TSV)   2D SDfile   Computed 3D by Vconf -m prep SDfile
Find this compound or compounds like it in BindingDB:
Activity Spreadsheet -- Enzyme Inhibition Constant Data from BindingDB
Found 2 hits for monomerid = 50047559
TargetAcyl-CoA:cholesterol acyltransferase(Oryctolagus cuniculus)
Eisai
Curated by ChEMBL
LigandPNGBDBM50047559(1-(2,2-Dimethyl-propyl)-3-{2-[3-(5-ethyl-4-phenyl-...)
Affinity DataIC50:  68nM. Assay description: Inhibition against acyl coenzyme A:cholesterol acyltransferase derived from rabbit intestine microsomes
In DepthDetails ArticlePubMed
TargetAcyl-CoA:cholesterol acyltransferase(Oryctolagus cuniculus)
Eisai
Curated by ChEMBL
LigandPNGBDBM50047559(1-(2,2-Dimethyl-propyl)-3-{2-[3-(5-ethyl-4-phenyl-...)
Affinity DataIC50:  460nM. Assay description: Inhibition against acyl coenzyme A:cholesterol acyltransferase derived from rabbit intestine microsomes
In DepthDetails ArticlePubMed