BDBM50047606 1-(2-Ethyl-phenyl)-3-octadec-9-enyl-urea::CHEMBL47206
SMILES CCCCCCCC\C=C/CCCCCCCCNC(=O)Nc1ccccc1CC
InChI Key InChIKey=SAAOEPGXSNZHMH-QXMHVHEDSA-N
Data  1 IC50
  Tab Delimited (TSV)   2D SDfile   Computed 3D by Vconf -m prep SDfile
Find this compound or compounds like it in BindingDB:
Activity Spreadsheet -- Enzyme Inhibition Constant Data from BindingDB
Found 1 hit for monomerid = 50047606
TargetAcyl-CoA:cholesterol acyltransferase(Oryctolagus cuniculus)
Warner-Lambert
Curated by ChEMBL
LigandPNGBDBM50047606(1-(2-Ethyl-phenyl)-3-octadec-9-enyl-urea | CHEMBL4...)
Affinity DataIC50:  980nM. Assay description: Acyl coenzyme A:cholesterol acyltransferase (ACAT), inhibition by incubation with [1-14C]oleolyl-CoA and intestinal microsomes isolated from intestin...
In DepthDetails ArticlePubMed