BDBM50047614 1-(2,6-Dichloro-phenyl)-3-octadec-9-enyl-urea::CHEMBL46376
SMILES CCCCCCCC\C=C/CCCCCCCCNC(=O)Nc1c(Cl)cccc1Cl
InChI Key InChIKey=LEXSBXAJLQMEOT-KTKRTIGZSA-N
Data  1 IC50
  Tab Delimited (TSV)   2D SDfile   Computed 3D by Vconf -m prep SDfile
Find this compound or compounds like it in BindingDB:
Activity Spreadsheet -- Enzyme Inhibition Constant Data from BindingDB
Found 1 hit for monomerid = 50047614
TargetAcyl-CoA:cholesterol acyltransferase(Oryctolagus cuniculus)
Warner-Lambert
Curated by ChEMBL
LigandPNGBDBM50047614(1-(2,6-Dichloro-phenyl)-3-octadec-9-enyl-urea | CH...)
Affinity DataIC50:  400nM. Assay description: Acyl coenzyme A:cholesterol acyltransferase (ACAT), inhibition by incubation with [1-14C]oleolyl-CoA and intestinal microsomes isolated from intestin...
In DepthDetails ArticlePubMed